{"text_format":"3","workbook":"xlsx","n_sheets":4,"sheets":["シート管理","市価調査内訳書","市価調査表紙","入札書"],"not_rendered":{"macros":1,"external_links":24,"defined_names":314},"read":"whole","date_system":"1900"}

{"sheet":"シート管理","index":0,"n_rows":80,"n_cols":28,"rows_kept":80,"hidden":true,"merged":[[13,4,13,10],[15,5,16,5],[15,6,16,6],[15,7,16,7],[15,8,16,8],[15,9,16,9],[15,10,16,10],[17,7,18,10],[19,7,20,10],[24,4,24,10],[26,5,27,5],[26,6,27,6],[26,7,27,7],[26,8,27,8],[26,9,27,9],[26,10,27,10],[28,7,29,10],[30,7,31,10],[35,4,35,10],[37,5,38,5],[37,6,38,6],[37,7,38,7],[37,8,38,8],[37,9,38,9],[37,10,38,10],[39,7,40,10],[41,7,42,10]]}
[{"$f":"RIGHT(CELL(\"filename\",シート管理!WFD1000000),LEN(CELL(\"filename\",シート管理!WFD1000000))-SEARCH(\"]\",CELL(\"filename\",シート管理!WFD1000000)))","v":"シート管理"},"非表示","AM","アンプル","\\",{"$f":"DBCS(E1)","v":"￥"},"株式会社","（株）","(株)","㈱",null,"契約担当官","契約班長","点検","係",null,"契約班長","点検","立会者","係",null,"契約係長","立会者","係",null,{"$f":"#REF!","v":{"$error":"#REF!"}},"契約班長","係"]
[{"$f":"RIGHT(CELL(\"filename\",#REF!),LEN(CELL(\"filename\",#REF!))-SEARCH(\"]\",CELL(\"filename\",#REF!)))","v":{"$error":"#REF!"}},"常時","AT","アソート","/","／","有限会社","（有）","(有)","㈲"]
[{"$f":"RIGHT(CELL(\"filename\",#REF!),LEN(CELL(\"filename\",#REF!))-SEARCH(\"]\",CELL(\"filename\",#REF!)))","v":{"$error":"#REF!"}},"常時","AY","アッセン",":","：","合名会社","（名）","(名)","㈴"]
[{"$f":"RIGHT(CELL(\"filename\",#REF!),LEN(CELL(\"filename\",#REF!))-SEARCH(\"]\",CELL(\"filename\",#REF!)))","v":{"$error":"#REF!"}},"非表示","BA","ボール","*","＊","合資会社","（資）","(資)","㈾"]
[{"$f":"RIGHT(CELL(\"filename\",#REF!),LEN(CELL(\"filename\",#REF!))-SEARCH(\"]\",CELL(\"filename\",#REF!)))","v":{"$error":"#REF!"}},"市価","BD","バンドル","?","？","合同会社","（同）","(同)","(同)",{"$nulls":6},"入札書の原本と相違ないことを証明する。"]
[{"$f":"RIGHT(CELL(\"filename\",#REF!),LEN(CELL(\"filename\",#REF!))-SEARCH(\"]\",CELL(\"filename\",#REF!)))","v":{"$error":"#REF!"}},"市価","BE","ベイル","\"","”","一般財団法人","（一財）","(一財)","㈶"]
[{"$f":"RIGHT(CELL(\"filename\",#REF!),LEN(CELL(\"filename\",#REF!))-SEARCH(\"]\",CELL(\"filename\",#REF!)))","v":{"$error":"#REF!"}},"開札","BF","ボートフ","<","＜","公益財団法人","（公財）","(公財)","(公財)",{"$nulls":6},{"$f":"DBCS(TEXT(#REF!,\"ggge年m月d日\"))","v":{"$error":"#REF!"}}]
[{"$f":"RIGHT(CELL(\"filename\",#REF!),LEN(CELL(\"filename\",#REF!))-SEARCH(\"]\",CELL(\"filename\",#REF!)))","v":{"$error":"#REF!"}},"開札","BG","袋",">","＞","財団法人","（財）","(財)","㈶"]
[{"$f":"RIGHT(CELL(\"filename\",#REF!),LEN(CELL(\"filename\",#REF!))-SEARCH(\"]\",CELL(\"filename\",#REF!)))","v":{"$error":"#REF!"}},"開札","BI","尾","|",{"$f":"DBCS(E9)","v":"｜"},"社団法人","（社）","(社)","㈳",{"$nulls":6},{"$f":"#REF!","v":{"$error":"#REF!"}}]
[{"$f":"RIGHT(CELL(\"filename\",市価調査内訳書!WFD1000000),LEN(CELL(\"filename\",市価調査内訳書!WFD1000000))-SEARCH(\"]\",CELL(\"filename\",市価調査内訳書!WFD1000000)))","v":"市価調査内訳書"},"市価","BK","ブック",null,null,"一般社団法人","（一社）","(一社)","(一社)",{"$nulls":6},{"$f":"#REF!","v":{"$error":"#REF!"}}]
[{"$f":"RIGHT(CELL(\"filename\",#REF!),LEN(CELL(\"filename\",#REF!))-SEARCH(\"]\",CELL(\"filename\",#REF!)))","v":{"$error":"#REF!"}},"契約","BL","バーレル",null,null,"公益社団法人","（公社）","(公社)","(公社)",{"$nulls":6},{"$f":"OFFSET(#REF!,MATCH(Q9,#REF!,0),0)&\"　\"&OFFSET(#REF!,MATCH(Q9,#REF!,0),1)&\"　\"&OFFSET(#REF!,MATCH(Q9,#REF!,0),2)","v":{"$error":"#REF!"}}]
[{"$f":"RIGHT(CELL(\"filename\",市価調査表紙!WFD1000000),LEN(CELL(\"filename\",市価調査表紙!WFD1000000))-SEARCH(\"]\",CELL(\"filename\",市価調査表紙!WFD1000000)))","v":"市価調査表紙"},"市価","BO","ボルト",null,null,"社会福祉法人","（福）","(福)","(福)"]
[{"$f":"RIGHT(CELL(\"filename\",#REF!),LEN(CELL(\"filename\",#REF!))-SEARCH(\"]\",CELL(\"filename\",#REF!)))","v":{"$error":"#REF!"}},"市価","BR","バー",null,null,"相互会社","（相）","(相)","(相)"]
[{"$f":"RIGHT(CELL(\"filename\",#REF!),LEN(CELL(\"filename\",#REF!))-SEARCH(\"]\",CELL(\"filename\",#REF!)))","v":{"$error":"#REF!"}},"市価","BT","ボトル","文書管理情報"]
[{"$f":"RIGHT(CELL(\"filename\",#REF!),LEN(CELL(\"filename\",#REF!))-SEARCH(\"]\",CELL(\"filename\",#REF!)))","v":{"$error":"#REF!"}},"開札","BX","箱","文書管理者","：",{"$f":"#REF!","v":{"$error":"#REF!"}},null,"開示","部分開示","不開示"]
[{"$f":"RIGHT(CELL(\"filename\",#REF!),LEN(CELL(\"filename\",#REF!))-SEARCH(\"]\",CELL(\"filename\",#REF!)))","v":{"$error":"#REF!"}},"開札","CA","カートリ","一元的な管理に","：","同上","作成時",null,"〇"]
[{"$f":"RIGHT(CELL(\"filename\",#REF!),LEN(CELL(\"filename\",#REF!))-SEARCH(\"]\",CELL(\"filename\",#REF!)))","v":{"$error":"#REF!"}},"契約","CB","カーボイ","責任を有する者"]
[{"$f":"RIGHT(CELL(\"filename\",#REF!),LEN(CELL(\"filename\",#REF!))-SEARCH(\"]\",CELL(\"filename\",#REF!)))","v":{"$error":"#REF!"}},"契約","CD","立方ＹＤ","分類番号","：","Ａ－４０－０３４","区分：①　２　３　４　５　６"]
[{"$f":"RIGHT(CELL(\"filename\",#REF!),LEN(CELL(\"filename\",#REF!))-SEARCH(\"]\",CELL(\"filename\",#REF!)))","v":{"$error":"#REF!"}},"契約","CE","コーン","作成年月日","：",{"$f":"DBCS(TEXT(#REF!,\"yyyy.m.d\"))","v":{"$error":"#REF!"}}]
[{"$f":"RIGHT(CELL(\"filename\",#REF!),LEN(CELL(\"filename\",#REF!))-SEARCH(\"]\",CELL(\"filename\",#REF!)))","v":{"$error":"#REF!"}},"契約","CF","立方ＦＴ","取得年月日","：",null,"理由：個人に関する情報"]
[null,null,"CK","ケーキ","保存期間","：","５年"]
[null,null,"CL","コイル","保存期間満了日","：",{"$f":"DBCS(IF(MONTH(#REF!)<4,YEAR(#REF!)+5,YEAR(#REF!)+6)&\".3.31\")","v":{"$error":"#REF!"}}]
[null,null,"CN","缶","本紙含め","：",{"$f":"DBCS(#REF!&\"枚\")","v":{"$error":"#REF!"}}]
[null,null,"CO","コンテナ","配布先","：",{"$f":"LEFT(#REF!,SEARCH(\"　\",#REF!)-1)&\"、\"&LEFT(#REF!,SEARCH(\"　\",#REF!)-1)&\"。　２箇所\"","v":{"$error":"#REF!"}}]
[null,null,"CY","シリンダ","文書管理情報"]
[null,null,"CZ","立方ＭＲ","文書管理者","：",{"$f":"G15","v":{"$error":"#REF!"}},null,"開示","部分開示","不開示"]
[null,null,"DR","ドラム","一元的な管理に","：","同上","作成時",null,"〇"]
[null,null,"DZ","ダース","責任を有する者"]
[null,null,"EA","個","分類番号","：","Ａ－４０－０３４","区分：①　２　３　４　５　６"]
[null,null,"FT","フィート","作成年月日","：",{"$f":"G19","v":{"$error":"#REF!"}}]
[null,null,"GL","ガロン","取得年月日","：",null,"理由：個人に関する情報"]
[null,null,"GM","グラム","保存期間","：","５年"]
[null,null,"GP","グループ","保存期間満了日","：",{"$f":"G22","v":{"$error":"#REF!"}}]
[null,null,"GR","グロス","本紙含め","：",{"$f":"G23","v":{"$error":"#REF!"}}]
[null,null,"GY","玉","配布先","：",{"$f":"LEFT(#REF!,SEARCH(\"　\",#REF!)-1)&\"。　１箇所\"","v":{"$error":"#REF!"}}]
[null,null,"HD",100,"文書管理情報"]
[null,null,"HH","杯","文書管理者","：",{"$f":"G26","v":{"$error":"#REF!"}},null,"開示","部分開示","不開示"]
[null,null,"HI","匹","一元的な管理に","：","同上","作成時",null,"〇"]
[null,null,"HK","ハンク","責任を有する者"]
[null,null,"HN","本","分類番号","：","Ａ－４０－０３４","区分：①　２　３　４　５　６"]
[null,null,"IN","インチ","作成年月日","：",{"$f":"G30","v":{"$error":"#REF!"}}]
[null,null,"JR","ジャー","取得年月日","：",null,"理由：個人に関する情報"]
[null,null,"KG","kg","保存期間","：","５年"]
[null,null,"KI","切","保存期間満了日","：",{"$f":"G33","v":{"$error":"#REF!"}}]
[null,null,"KN","斤","本紙含め","：",{"$f":"G34","v":{"$error":"#REF!"}}]
[null,null,"KT","キット","配布先","：",{"$f":"LEFT(#REF!,SEARCH(\"　\",#REF!)-1)&\"。　１箇所\"","v":{"$error":"#REF!"}}]
[null,null,"LB","ポンド"]
[null,null,"LI","リットル"]
[null,null,"ME","ミール"]
[null,null,"MR","メートル"]
[null,null,"MX",1000]
[null,null,"OT","ＯＦＩＴ"]
[null,null,"OZ","オンス"]
[null,null,"PC","パック"]
[null,null,"PG","包"]
[null,null,"PM","プレイト"]
[null,null,"PR","ペア"]
[null,null,"PT","パイント"]
[null,null,"PZ","パケット"]
[null,null,"QT","クオート"]
[null,null,"RA","レイショ"]
[null,null,"RL","リール"]
[null,null,"RM","リーム"]
[null,null,"RO","ロール"]
[null,null,"SD","スキッド"]
[null,null,"SE","セット"]
[null,null,"SF","平方ＦＴ"]
[null,null,"SH","枚"]
[null,null,"SK","スケイン"]
[null,null,"SL","スプール"]
[null,null,"SM","平方ＭＲ"]
[null,null,"SO","ショット"]
[null,null,"SP","片"]
[null,null,"SX","スティク"]
[null,null,"SY","平方ＹＤ"]
[null,null,"TN","トン"]
[null,null,"TO","トロイ"]
[null,null,"TY","丁"]
[null,null,"VI","バイアル"]
[null,null,"YD","ヤード"]

{"sheet":"市価調査内訳書","index":1,"n_rows":361,"n_cols":19,"rows_kept":361,"merged":[[0,1,0,6]]}
[null,"内　訳　書",{"$nulls":6},"A1:G361"]
[null,"品名","規格","単位","予定\n数量","単価","備考",null,15]
[1,"ビタミン強化米","Ａ１００６Ｆ　規格表のとおり","個",{"v":2,"d":"2  "}]
[2,"発芽玄米グラノーラ","内容量２３０ｇゆめぴりか使用Ａ３０６７Ａ準ずる規格表のとおり","個",{"v":12,"d":"12  "}]
[3,"フレンチトースト△","１個１００ｇＡ２０００１規格表のとおり","個",{"v":455,"d":"455  "}]
[4,"パネトーネクロワッサン△","１個３２ｇ５個入Ａ２０００１　規格表のとおり","袋",{"v":48,"d":"48  "}]
[5,"クロワッサン（ウィンナー）△","１個８５ｇＡ２０００１　規格表のとおり","個",{"v":455,"d":"455  "}]
[6,"コッペパン（ふんわりクリーム２種）△","１個１００ｇＡ２０００１　規格表のとおり","個",{"v":800,"d":"800  "}]
[7,"コッペパン生（キャラメル）△","ティラミス風味１個１００ｇＡ２０００１規格表のとおり","個",{"v":243,"d":"243  "}]
[8,"デニッシュカスタード＆ホイップパン△","１個９２ｇＡ２０００１規格表のとおり","個",{"v":800,"d":"800  "}]
[9,"パーカーサンドチキンカツ△","１個１００ｇＡ２０００１規格表のとおり","個",{"v":459,"d":"459  "}]
[10,"サンドイッチパック（惣菜）△","２枚入焼き鳥風＆マヨＡ２０００１規格表のとおり","個",{"v":452,"d":"452  "}]
[11,"生ロールパンホイップ＆クリーム４個入△","４個入Ａ２０００１規格表のとおり","個",{"v":452,"d":"452  "}]
[12,"あんぱん玄米入り△","１個１００ｇＡ２０００１　規格表のとおり","個",{"v":800,"d":"800  "},{"$nulls":13},0]
[13,"ダッチパンチーズ△","１個１００ｇＡ２０００１規格表のとおり","個",{"v":800,"d":"800  "}]
[14,"フランスパンカスタードクリーム△","１個９０ｇ　Ａ２０００１規格表のとおり","個",{"v":459,"d":"459  "}]
[15,"カステラサンド生ジャム＆マーガリン△","１個８５ｇ　Ａ２０００１　規格表のとおり","個",{"v":455,"d":"455  "}]
[16,"バターチキンカレーのナン△","１個１００ｇＡ２０００１　規格表のとおり","個",{"v":800,"d":"800  "}]
[17,"ボロネーゼパン△","１個８０ｇ　Ａ２０００１規格表のとおり","個",{"v":300,"d":"300  "}]
[18,"みかんあんぱん△","１個８０ｇＡ２０００１　規格表のとおり","個",{"v":800,"d":"800  "}]
[19,"惣菜パン（粗挽きポークウィンナー）△","１個１００ｇ　Ａ２０００１　規格表のとおり","個",{"v":455,"d":"455  "}]
[20,"ポテトサラダパン△","１個１２０ｇＡ２０００１規格表のとおり","個",{"v":800,"d":"800  "}]
[21,"メロンデニッシュ四角いチョコチップ△","１個１００ｇＡ２０００１規格表のとおり","個",{"v":800,"d":"800  "}]
[22,"ちぎりパン（ピザチーズ）△","１個１４５ｇ　Ａ２０００１規格表のとおり","個",{"v":800,"d":"800  "}]
[23,"生パンケーキ△","１個１００ｇ生キャラメルホイップＡ２０００１規格表のとおり","個",{"v":300,"d":"300  "}]
[24,"パック入サンドイッチ△","カツ､卵､ツナ､ハム､チーズ５種類Ａ２０００１規格表のとおり","個",{"v":60,"d":"60  "}]
[25,"サンドウィッチ△","ミックス１個１００ｇ常温保存可Ａ２０００１規格表のとおり","個",{"v":1255,"d":"1,255  "}]
[26,"ベイクドアップクロワッサン（冷）","Ａ２０７１Ｂ　規格表のとおり","個",{"v":800,"d":"800  "}]
[27,"穀物ロールパン（冷）△","亜麻仁キヌア配合１０個入Ａ２０７１Ｂ規格表のとおり","個",{"v":104,"d":"104  "}]
[28,"冷凍うどん　△","Ａ３０２１Ｃ　規格表のとおり","kg",{"v":360,"d":"360  "}]
[29,"冷たいカップうどん　△","内容量２２０ｇタレ付Ａ３０２１Ｃに準ずる　規格表のとおり","個",{"v":674,"d":"674  "}]
[30,"冷凍ラーメン　△","Ａ３０２６Ｃ　規格表のとおり","kg",{"v":276,"d":"276  "}]
[31,"焼そば用蒸麺　△","Ａ３０２７　規格表のとおり","kg",{"v":37,"d":"37  "}]
[32,"冷凍スパゲティ△","Ａ３０３４Ｆ　規格表のとおり","kg",{"v":252,"d":"252  "}]
[33,"マカロニ（フジッリ）","Ａ３０３４Ｂに準ずる　規格表のとおり","kg",{"v":12,"d":"12  "}]
[34,"クルルマカロニ△","Ａ３０３４Ｋ　規格表のとおり","kg",{"v":12,"d":"12  "}]
[35,"冷凍そば△","田舎そば　Ａ３０６１Ｃ　規格表のとおり","kg",{"v":200,"d":"200  "}]
[36,"肉詰ワンタン　△","Ａ４０７４Ａ　規格表のとおり","kg",{"v":10,"d":"10  "}]
[37,"パック入チキンたっぷりペペロンチーノ","内容量１５０ｇ程度Ｕ１００００規格表のとおり","kg",{"v":455,"d":"455  "}]
[38,"皮むき馬鈴薯△","Ｂ１０１１Ｂ　規格表のとおり","kg",{"v":207,"d":"207  "}]
[39,"ミニベイクドポテト","１ｋｇ詰皮付キタアカリＢ１０１１Ａに準ずる　規格表のとおり","kg",{"v":42,"d":"42  "}]
[40,"こんにゃく　△","Ｂ２００３Ａ　規格表のとおり","kg",{"v":71,"d":"71  "}]
[41,"つきこんにゃく△","Ｂ２００３Ｂ　規格表のとおり","kg",{"v":32,"d":"32  "}]
[42,"白滝　△","Ｂ２００４Ａ　規格表のとおり","kg",{"v":109,"d":"109  "}]
[43,"マチルダポテト△","冷凍芽室産ポテト使用Ｂ１０１１Ｅに準ずる規格表のとおり","kg",{"v":62,"d":"62  "}]
[44,"里芋　△","Ｂ２００８Ａ　規格表のとおり","kg",{"v":99,"d":"99  "}]
[45,"長芋すりおろし△","Ｂ２０１８Ｃ　規格表のとおり","kg",{"v":26,"d":"26  "}]
[46,"刻み長芋５ｍｍ幅△","冷凍国産　Ｂ２０１８Ｄ　規格表のとおり","kg",{"v":41,"d":"41  "}]
[47,"アセロラミルク△","内容量４０ｇＣａ＆ＦＥ入　Ｄ１００００　規格表のとおり","個",{"v":1044,"d":"1,044  "}]
[48,"ココアワッフル△","２８ｇ個包装Ｆｅ入　Ｄ１００００　規格表のとおり","個",{"v":1033,"d":"1,033  "}]
[49,"白胡麻","Ｆ１０１２Ｂ　規格表のとおり","kg",{"v":5,"d":"5  "}]
[50,"カシューナッツ","内容量１袋１㎏詰　Ｆ１０１２Ｂ規格表に準ずる","袋",{"v":12,"d":"12  "}]
[51,"くるみ","内容量１袋２００ｇ詰　Ｆ１０１２Ｂ規格表に準ずる","袋",{"v":10,"d":"10  "}]
[52,"胡麻和えの素","Ｆ１０２６Ａ　規格表のとおり","個",{"v":7,"d":"7  "}]
[53,"むき枝豆△","内容量５００ｇ　Ｇ１００００　規格表のとおり","袋",{"v":56,"d":"56  "}]
[54,"ミックスビーンズ△","ヒヨコ豆以下３種１ｋｇ詰常温　Ｇ１００００規格表のとおり","kg",{"v":41,"d":"41  "}]
[55,"プチ豆腐　△","Ｇ２０２１Ｆ　規格表のとおり","kg",{"v":173,"d":"173  "}]
[56,"ミニ豆腐（５０ｇ）　△","Ｇ２０２１Ｇ　規格表のとおり","個",{"v":400,"d":"400  "}]
[57,"ソフトダイス豆腐　△","１個７ｇ　Ｇ２０２１Ｆに準ずる　規格表のとおり","kg",{"v":160,"d":"160  "}]
[58,"焼豆腐　　△","Ｇ２０２３　規格表のとおり","kg",{"v":15,"d":"15  "}]
[59,"冷凍絹揚げ豆腐カットタイプ△","１ＫＧ詰１個１０ｇ９０～１０５個入Ｇ１００００規格表のとおり","kg",{"v":120,"d":"120  "}]
[60,"油揚　　△","Ｇ２０２５０　規格表のとおり","kg",{"v":56,"d":"56  "}]
[61,"引割納豆　△","Ｇ２０２９Ａ　規格表のとおり","個",{"v":800,"d":"800  "}]
[62,"納豆　　△","Ｇ２０２９　規格表のとおり","個",{"v":2150,"d":"2,150  "}]
[63,"豆乳飲料　△","３種混合Ｇ２０３９Ｃ規格表のとおり","個",{"v":1289,"d":"1,289  "}]
[64,"そい黒こしょう漬△","１枚１２０ｇ黒こしょうに漬けたものＨ００００１規格表のとおり","kg",{"v":125,"d":"125  "}]
[65,"秋鮭味噌マヨ漬△","１枚１２０ｇ甘みそマヨネーズたれＨ１０７７Ｃ規格表のとおり","kg",{"v":24,"d":"24  "}]
[66,"トラウトサーモン　△","Ｈ１０７７Ｊ　規格表のとおり","kg",{"v":100,"d":"100  "}]
[67,"さば（フィレ）△","Ｈ１０８４Ａ　規格表のとおり","kg",{"v":160,"d":"160  "}]
[68,"たらこスパゲティソース△","内容量１ＫＧ　Ｈ００００１規格表のとおり","kg",{"v":10,"d":"10  "}]
[69,"スティック明太子△","Ｈ１１１８Ｅ　規格表のとおり","個",{"v":100,"d":"100  "}]
[70,"とびっこ　　△","Ｈ１１２１Ａ　規格表のとおり","kg",{"v":8,"d":"8  "}]
[71,"ぶり切身　△","Ｈ１１４２Ｅ　規格表のとおり","kg",{"v":120,"d":"120  "}]
[72,"帆立貝柱フレークＢ△","国内産Ｈ１１９６Ｆ規格表のとおり","kg",{"v":30,"d":"30  "}]
[73,"かのこいか　△","Ｈ１２０６Ｇ　規格表のとおり","kg",{"v":18,"d":"18  "}]
[74,"いか刺し昆布△","内容量１ＫＧ詰Ｈ００００１規格表のとおり","kg",{"v":8,"d":"8  "}]
[75,"冷凍ムキエビ△","Ｈ１２２１Ｂ　規格表のとおり","kg",{"v":26,"d":"26  "}]
[76,"生食用ボイルえび△","内容量５００ｇＨ００００１　規格表のとおり","kg",{"v":11,"d":"11  "}]
[77,"中華くらげ　△","Ｈ１２３５Ａ　規格表のとおり","kg",{"v":8,"d":"8  "}]
[78,"鮭塩焼（レ）２０ｇ△","１枚２０ｇレトルトＨ００００１　規格表のとおり","kg",{"v":11,"d":"11  "}]
[79,"鮭のほぐし身　△","内容量５００ｇ道東秋鮭使用　Ｈ００００１　規格表のとおり","kg",{"v":11,"d":"11  "}]
[80,"骨までやわらかさばみそ煮（レ）　△","骨も柔らかく煮たものＨ１５０５Ｅに準ずる規格表のとおり","kg",{"v":60,"d":"60  "}]
[81,"骨までやわらかさば生姜煮（レ）△","Ｈ１５０５Ｇ　規格表のとおり","kg",{"v":20,"d":"20  "}]
[82,"骨なしさば塩焼き（レ）△","１枚２０ｇ１０枚入レトルトＨ００００１規格表のとおり　","袋",{"v":50,"d":"50  "}]
[83,"開きほっけ　　△","Ｈ２１４６Ｂ　規格表のとおり","kg",{"v":80,"d":"80  "}]
[84,"カニカマフレーク△","Ｈ３２４６Ｄ　規格表のとおり","kg",{"v":100,"d":"100  "}]
[85,"ミニ笹蒲鉾　△","Ｈ３２４６Ｆ　規格表のとおり","kg",{"v":10,"d":"10  "}]
[86,"焼竹輪　　△","Ｈ３２５０　規格表のとおり","kg",{"v":28,"d":"28  "}]
[87,"チーズイン豆ちくわ△","冷凍５００ｇ詰４０個入　Ｈ３００００　規格表のとおり","袋",{"v":20,"d":"20  "}]
[88,"オランダ揚　△","Ｈ３２５６　規格表のとおり","kg",{"v":10,"d":"10  "}]
[89,"真ほっけ甘辛竜田△","小樽産１個４０ｇ１０切入４００ｇ詰　Ｈ０００１規格表のとおり","袋",{"v":45,"d":"45  "}]
[90,"牛バラ肉（角切り）　△","Ｉ１０１３Ｂ　規格表のとおり","kg",{"v":6,"d":"6  "}]
[91,"牛バラスライス△","Ｉ１０１３Ｄ　規格表のとおり","kg",{"v":83,"d":"83  "}]
[92,"牛肉（モモ）　△","Ｉ１０１５Ｄ　規格表のとおり","kg",{"v":42,"d":"42  "}]
[93,"牛肉（モモスライス）△","Ｉ１０１５Ｅ　規格表のとおり","kg",{"v":74,"d":"74  "}]
[94,"牛挽肉　　△","Ｉ１０２２　規格表のとおり","kg",{"v":21,"d":"21  "}]
[95,"砂肝炭火焼き△","冷凍品内容量１ｋｇ詰Ｉ１１０００規格表のとおり","個",{"v":63,"d":"63  "}]
[96,"鶏レバー△","３ｃｍ角カット新鮮なものＩ１００００規格表のとおり","kg",{"v":60,"d":"60  "}]
[97,"若鶏手羽先　　△","Ｉ１１４６Ｃ　規格表のとおり","kg",{"v":5,"d":"5  "}]
[98,"鶏ジンギスカン△","内容量３００ｇＩ１１００規格表のとおり","袋",{"v":10,"d":"10  "}]
[99,"鶏モモ正肉１５０ｇ　　△","Ｉ１１４９Ｋ規格表のとおり","kg",{"v":276,"d":"276  "}]
[100,"鶏モモ正肉（小間切り）△","Ｉ１１４９Ｑ　規格表のとおり","kg",{"v":277,"d":"277  "}]
[101,"鶏モモ正肉５０ｇカット△","Ｉ１１４９Ｓ　規格表のとおり","kg",{"v":156,"d":"156  "}]
[102,"鶏挽肉　　　△","Ｉ１１５２Ａ　規格表のとおり","kg",{"v":8,"d":"8  "}]
[103,"鶏がら　　　△","Ｉ１１５９Ａ規格表のとおり","kg",{"v":5,"d":"5  "}]
[104,"ガラポン鶏がら　　　△","Ｉ１１５９Ｂ　規格表のとおり","個",{"v":15,"d":"15  "}]
[105,"豚上肉（肩ローススライス）△","Ｉ１２６５Ｃ　規格表のとおり","kg",{"v":243,"d":"243  "}]
[106,"豚上肉（肩ロース）１ｃｍスライス△","Ｉ１２６５Ｆ規格表のとおり","kg",{"v":20,"d":"20  "}]
[107,"豚上肉（背ロース）△","Ｉ１２６７Ｂ筋切りした物　規格表のとおり","kg",{"v":100,"d":"100  "}]
[108,"豚並肉（バラスライス）△","Ｉ１２６９Ｃ　規格表のとおり","kg",{"v":205,"d":"205  "}]
[109,"豚並肉（バラ２ｃｍ角）△","Ｉ１２６９Ｅ　規格表のとおり","kg",{"v":30,"d":"30  "}]
[110,"豚並肉（バラ１０ｇカット）　△","Ｉ１２６９Ｋ　規格表のとおり","kg",{"v":123,"d":"123  "}]
[111,"豚並肉（バラ５ｍｍカット）　△","Ｉ１２６９Ｐ　規格表のとおり","kg",{"v":15,"d":"15  "}]
[112,"豚上肉（モモスライス）△","Ｉ１２７１Ｃ　規格表のとおり","kg",{"v":40,"d":"40  "}]
[113,"豚上肉（モモ２ｃｍ角）△","Ｉ１２７１Ｄ　規格表のとおり","kg",{"v":28,"d":"28  "}]
[114,"ネット付北海道産豚モモ肉　△","Ｉ１２７３Ｃ　規格表のとおり","kg",{"v":62,"d":"62  "}]
[115,"豚挽肉　　　△","Ｉ１２７６　規格表のとおり","kg",{"v":112,"d":"112  "}]
[116,"豚　　骨　　　△","解凍・縦カットした状態で納品　Ｉ１２８３Ａ　規格表のとおり","kg",{"v":57,"d":"57  "}]
[117,"ガラポン豚骨△","内容量２ｋｇ冷凍品　Ｉ１２８３Ｂ　規格表のとおり","個",{"v":20,"d":"20  "}]
[118,"焼豚小間　△","Ｉ１４８４２　規格表のとおり","個",{"v":69,"d":"69  "}]
[119,"ベーコン　△","Ｉ１４８５Ａ　規格表のとおり","kg",{"v":27,"d":"27  "}]
[120,"厚切りベーコン　△","Ｉ１４８５Ａを厚さ０．８ｃｍスライスしたもの　規格表のとおり","kg",{"v":60,"d":"60  "}]
[121,"ロースハム　　△","Ｉ１４８６Ｃ　規格表のとおり","kg",{"v":42,"d":"42  "}]
[122,"ロースハム（０．６ｃｍスライス）△","Ｉ１４８６Ｅ　規格表のとおり","kg",{"v":30,"d":"30  "}]
[123,"ロースハム（ダイスカット）△","Ｉ１４８６Ｃを１ｃｍダイスカットしたもの　規格表のとおり","kg",{"v":41,"d":"41  "}]
[124,"あらびきウィンナー△","Ｉ１４８７Ｅ　規格表のとおり","kg",{"v":60,"d":"60  "}]
[125,"バジルウィンナー△","Ｉ１４８７Ｅに準ずる規格表のとおり","kg",{"v":15,"d":"15  "}]
[126,"蒸し鶏　　　　△","Ｉ１５０２Ｂ　規格表のとおり","kg",{"v":90,"d":"90  "}]
[127,"銘柄鶏卵　△","Ｊ１００５Ｂ　規格表のとおり","kg",{"v":246,"d":"246  "}]
[128,"温泉卵△","Ｊ１００５Ｄ　規格表のとおり","kg",{"v":188,"d":"188  "}]
[129,"半熟茹卵のサラダ△","Ｊ１００５Ｅ　規格表のとおり","kg",{"v":22,"d":"22  "}]
[130,"うずら卵水煮レトルト△","Ｊ１１０４Ａ規格表のとおり","個",{"v":28,"d":"28  "}]
[131,"厚焼卵　　△","Ｊ１２１５Ａ　規格表のとおり","kg",{"v":10,"d":"10  "}]
[132,"半熟卵（洋風）△","Ｊ１２１６Ｇ　規格表のとおり","個",{"v":71,"d":"71  "}]
[133,"乾燥金糸卵","Ｊ１４０８Ａ　規格表のとおり","kg",{"v":5,"d":"5  "}]
[134,"牛乳（１０００ｍｌ）　△","Ｋ１００２Ａ　規格表のとおり","個",{"v":83,"d":"83  "}]
[135,"牛乳　　△","Ｋ１００２　規格表のとおり","個",{"v":7000,"d":"7,000  "}]
[136,"乳飲料　　　△","Ｋ１００５Ａ　各種混合　規格表のとおり","個",{"v":1000,"d":"1,000  "}]
[137,"生クリーム　△","Ｋ１００６Ｂ　規格表のとおり","個",{"v":47,"d":"47  "}]
[138,"のむヨーグルト（シロタ株乳酸菌入）△","内容量１２５ｇビタミンＤ強化Ｋ００００１規格表のとおり","個",{"v":1038,"d":"1,038  "}]
[139,"ヨーグルト（乳酸菌シロタ株入）　△","内容量１００ｍｌ種類混合Ｋ００００１規格表のとおり","個",{"v":701,"d":"701  "}]
[140,"アロエヨーグルト（８０）△","内容量８０ｇ　Ｋ００００１　規格表のとおり","個",{"v":1035,"d":"1,035  "}]
[141,"ヨーグルト鉄分強化△","１個７０ｇカルシュウム、鉄強化Ｋ００００１規格表のとおり","個",{"v":400,"d":"400  "}]
[142,"プレーンヨーグルト△","内容量８００ｇＫ１００９Ａに準ずる　規格表のとおり","個",{"v":186,"d":"186  "}]
[143,"乳酸菌飲料△","内容量２００ｍｌ殺菌Ｋ００００１　規格表のとおり","個",{"v":455,"d":"455  "}]
[144,"北海道限定乳酸菌飲料（Ｃａ、Ｚｎ入）△","内容量１８０ｍｌ　Ｋ００００１規格表のとおり","個",{"v":1038,"d":"1,038  "}]
[145,"ミニバター　△","Ｅ１０２８Ａ　規格表のとおり","個",{"v":800,"d":"800  "}]
[146,"さやいんげん△","Ｌ１００６Ｃ　規格表のとおり","kg",{"v":7,"d":"7  "}]
[147,"さやえんどう△","Ｌ１００９Ｃ　規格表のとおり","kg",{"v":14,"d":"14  "}]
[148,"スナップえんどう△","Ｌ１００９Ｄ　規格表のとおり","kg",{"v":59,"d":"59  "}]
[149,"水菜△","Ｌ１０２７Ａ　規格表のとおり","kg",{"v":54,"d":"54  "}]
[150,"冷凍小松菜カット△","Ｌ１０３２Ｄ　規格表のとおり","kg",{"v":219,"d":"219  "}]
[151,"青梗菜△","Ｌ１０７４Ａ　規格表のとおり","kg",{"v":52,"d":"52  "}]
[152,"カイエンペッパー（パウダー）","内容量３００ｇＬ１０８０Ｃに準ずる規格表のとおり","個",{"v":2,"d":"2  "}]
[153,"プチトマト△","Ｌ１０８５Ａ　規格表のとおり","kg",{"v":69,"d":"69  "}]
[154,"にら△","Ｌ１０９３Ａ　規格表のとおり","kg",{"v":35,"d":"35  "}]
[155,"人参△","Ｌ１０９４Ａ　規格表のとおり","kg",{"v":402,"d":"402  "}]
[156,"ピーマン△","Ｌ１１０８Ａ　規格表のとおり","kg",{"v":114,"d":"114  "}]
[157,"カラーピーマン△","Ｌ１１０８Ｂ　規格表のとおり","kg",{"v":44,"d":"44  "}]
[158,"ブロッコリー（冷）△","Ｌ１１１４Ｃ　規格表のとおり","kg",{"v":186,"d":"186  "}]
[159,"冷凍ほうれん草△","Ｌ１１１７Ｂ　規格表のとおり","kg",{"v":76,"d":"76  "}]
[160,"みつば△","Ｌ１１２３Ａ　規格表のとおり","kg",{"v":15,"d":"15  "}]
[161,"万能ねぎ△","Ｌ１１３９Ｃ　規格表のとおり","kg",{"v":2,"d":"2  "}]
[162,"ホールトマト","固形量１．８ｋｇカットしたもの　Ｌ１３８６Ｃ　規格表のとおり","個",{"v":24,"d":"24  "}]
[163,"トマトピューレ","Ｌ１３８６Ｄ　規格表のとおり","個",{"v":7,"d":"7  "}]
[164,"野菜と果物のジュース△","Ｌ１４８６Ｆ規格表のとおり","個",{"v":1113,"d":"1,113  "}]
[165,"野菜と果物ジュースミニ△","内容量１２５ｍｌ　Ｌ１４８６Ｈ規格表のとおり","個",{"v":1039,"d":"1,039  "}]
[166,"グリーンスムージー","内容量３３０ｍｌＬ１４８６Ｆに準ずる規格書のとおり","個",{"v":455,"d":"455  "}]
[167,"ゆかり","Ｌ１５３６　規格表のとおり","個",{"v":2,"d":"2  "}]
[168,"オクラホールＳ△","冷凍品内容量５００ｇ５０本入　Ｌ００００１　規格表のとおり","kg",{"v":34,"d":"34  "}]
[169,"刻みオクラ△","冷凍品内容量１ＫＧ詰　Ｌ００００１　規格表のとおり","個",{"v":16,"d":"16  "}]
[170,"グリーンピース（冷）△","Ｌ２０１１Ｃ　規格表のとおり","kg",{"v":1,"d":"1  "}]
[171,"れんこん水煮△","Ｌ２０１３Ａ　規格表のとおり","kg",{"v":20,"d":"20  "}]
[172,"スライスれんこん水煮△","Ｌ２０１３Ｂ規格表のとおり","kg",{"v":31,"d":"31  "}]
[173,"キャベツ△","Ｌ２０２４Ａ　規格表のとおり","kg",{"v":809,"d":"809  "}]
[174,"紫キャベツ△","Ｌ２０２４Ｃ　規格表のとおり","kg",{"v":15,"d":"15  "}]
[175,"胡瓜△","Ｌ２０２５Ａ　規格表のとおり","kg",{"v":273,"d":"273  "}]
[176,"牛　　蒡△","Ｌ２０３１Ａ　規格表のとおり","kg",{"v":84,"d":"84  "}]
[177,"切牛蒡△","Ｌ２０３１Ｃ　規格表のとおり","kg",{"v":30,"d":"30  "}]
[178,"線牛蒡△","Ｌ２０３１Ｄ　規格表のとおり","kg",{"v":71,"d":"71  "}]
[179,"笹がき牛蒡△","Ｌ２０３１Ｆ　規格表のとおり","kg",{"v":90,"d":"90  "}]
[180,"根生姜△","Ｌ２０４１Ａ　規格表のとおり","kg",0.5]
[181,"貝割菜△","Ｌ２０５４Ａ　規格表のとおり","kg",{"v":9,"d":"9  "}]
[182,"大根△","Ｌ２０５６Ａ　規格表のとおり","kg",{"v":722,"d":"722  "}]
[183,"味付メンマ△","Ｌ２０６９　規格表のとおり","kg",{"v":25,"d":"25  "}]
[184,"皮むき玉葱△","Ｌ２０７０Ｂ　規格表のとおり","kg",{"v":992,"d":"992  "}]
[185,"紫玉葱△","Ｌ２０７０Ｄ　規格表のとおり","kg",{"v":48,"d":"48  "}]
[186,"レタス△","Ｌ２０７３　規格表のとおり","kg",{"v":243,"d":"243  "}]
[187,"フリルレタス△","Ｌ２０７３Ｃ　規格表のとおり","kg",{"v":65,"d":"65  "}]
[188,"本生ニンニクみじん切り△","Ｌ２０９５Ｄ　規格表のとおり","個",{"v":2,"d":"2  "}]
[189,"フライドガーリック","Ｌ２０９５Ｅ　規格表のとおり","個",{"v":7,"d":"7  "}]
[190,"長　　葱△","Ｌ２０９６　規格表のとおり","kg",{"v":272,"d":"272  "}]
[191,"白菜△","Ｌ２１０１Ａ　規格表のとおり","kg",{"v":332,"d":"332  "}]
[192,"ふき水煮△","Ｌ２１１１Ｂ長さ２０ｃｍ程度規格表のとおり","kg",{"v":60,"d":"60  "}]
[193,"もやし△","１ＫＧ～５ＫＧ詰め　Ｌ２１２７Ａ　規格表のとおり","kg",{"v":152,"d":"152  "}]
[194,"小袋生わさび△","Ｌ２３１３９　規格表のとおり","個",{"v":1200,"d":"1,200  "}]
[195,"ねりうめ（しそ入り）","内容量５００ｇ詰Ｍ１００００規格表のとおり","個",{"v":2,"d":"2  "}]
[196,"オレンジ△","Ｍ１０２４Ｂ　規格表のとおり","kg",{"v":40,"d":"40  "}]
[197,"レモン△","Ｍ１０９２Ａ　規格表のとおり","kg",{"v":11,"d":"11  "}]
[198,"１００％ジュース△","各種混合　Ｍ１１２４Ｃ規格表のとおり","個",{"v":1000,"d":"1,000  "}]
{"$rows_left_out":162}
{"sheet":"市価調査表紙","index":2,"n_rows":17,"n_cols":14,"rows_kept":17,"merged":[[0,0,0,6],[1,4,1,6],[6,4,7,6],[8,4,9,6],[10,4,11,6],[12,4,12,6],[13,4,13,6]]}
["市場価格調査書",{"$nulls":7},"A1:G33",{"$nulls":4},"ボタンを押して作成されたデータ（PDFとCSV）は"]
[{"$nulls":4},"令和6年　　月　　日",{"$nulls":3},1,{"$f":"RIGHT(CELL(\"filename\",市価調査内訳書!WFD1000000),LEN(CELL(\"filename\",市価調査内訳書!WFD1000000))-SEARCH(\"]\",CELL(\"filename\",市価調査内訳書!WFD1000000)))","v":"市価調査内訳書"},{"$nulls":3},"両方とも官側へメールで提出願います。"]
[]
[null,"契約担当官",{"$nulls":9},"※ボタンを押してエラーメッセージが出る場合"]
[null,"航空自衛隊第２航空団",{"$nulls":9},"　一度ファイルを閉じてアイコンを右クリック"]
[null,"会計隊長　中村　匡利　殿",{"$nulls":9},"　→プロパティ"]
[{"$nulls":3},"住　　所：",{"$nulls":7},"　→全般"]
[null,"下記のとおり、お見積りいたします。",{"$nulls":9},"　→一番下、セキュリティ：「このファイルは他のコンピュータ"]
[{"$nulls":3},"会 社 名：",{"$nulls":7},"　　から取得～」の右、「許可する」にチェックを入れる"]
[null,"納期：令和６年６月１日～令和６年６月３０日",{"$nulls":9},"　→ファイルを開き、「マクロを有効にする」を選択する"]
[null,"納地：航空自衛隊千歳基地",null,"代 表 者：",{"$nulls":3},"←役職及び氏名"]
[]
[{"$nulls":3},"担 当 者：",{"$nulls":3},"←担当者の氏名と電話番号を記入した場合、押印省略可"]
[{"$nulls":3},"電話番号："]
[null,"品名","規格","単位","予定\n数量","単価","備考"]
[null,"内訳書のとおり"]
[null,"―以下余白―"]

{"sheet":"入札書","index":3,"n_rows":17,"n_cols":14,"rows_kept":17,"merged":[[0,0,0,6],[1,4,1,6],[2,0,2,6],[6,4,7,6],[8,4,9,6],[10,4,11,6],[12,4,12,6],[13,4,13,6]]}
["入札書",{"$nulls":7},"A1:G33",{"$nulls":4},"ボタンを押して作成されたデータ（PDFとCSV）は"]
[{"$nulls":4},{"$f":"[24]コマンド!C14","v":"2024-05-15"},{"$nulls":3},1,{"$f":"RIGHT(CELL(\"filename\",[24]入札内訳書!WFD1000000),LEN(CELL(\"filename\",[24]入札内訳書!WFD1000000))-SEARCH(\"]\",CELL(\"filename\",[24]入札内訳書!WFD1000000)))","v":"入札内訳書"},{"$nulls":3},"両方とも官側へメールで提出願います。"]
["貴通知・公告に対し、入札（見積）及び契約心得・標準契約条項等承知の上、下記のとおり提出いたします。"]
[null,"契約担当官",{"$nulls":9},"※ボタンを押してエラーメッセージが出る場合"]
[null,{"$f":"[24]コマンド!A2","v":"航空自衛隊第２航空団"},{"$nulls":9},"　一度ファイルを閉じてアイコンを右クリック"]
[null,{"$f":"[24]コマンド!B5&\"　\"&[24]コマンド!C5&\"　\"&[24]コマンド!D5&\"　殿\"","v":"会計隊長　中村　匡利　殿"},{"$nulls":9},"　→プロパティ"]
[{"$nulls":3},"住　　所：",{"$nulls":7},"　→全般"]
[null,"下記のとおり、入札します。",{"$nulls":9},"　→一番下、セキュリティ：「このファイルは他のコンピュータ"]
[{"$nulls":3},"会 社 名：",{"$nulls":7},"　　から取得～」の右、「許可する」にチェックを入れる"]
[null,{"$f":"DBCS(\"納期：\"&TEXT(DATE([24]コマンド!A14,[24]コマンド!B14,1),\"ggge年m月d日\")&\"～\"&TEXT(EOMONTH(DATE([24]コマンド!A14,[24]コマンド!B14,1),0),\"ggge年m月d日\"))","v":"納期：令和６年６月１日～令和６年６月３０日"},{"$nulls":9},"　→ファイルを開き、「マクロを有効にする」を選択する"]
[null,{"$f":"\"納地：航空自衛隊\"&[24]コマンド!A10&IF([24]コマンド!A10=[24]!テーブル1[[#Headers],[千歳]],\"基地\",\"分屯基地\")","v":"納地：航空自衛隊千歳基地"},null,"代 表 者：",{"$nulls":3},"←役職及び氏名"]
[]
[{"$nulls":3},"担 当 者：",{"$nulls":3},"←担当者の氏名と電話番号を記入した場合、押印省略可"]
[{"$nulls":3},"電話番号："]
[null,"品名","規格","単位","予定\n数量","単価","備考"]
[null,"内訳書のとおり"]
[null,"―以下余白―"]